{"text_format":"1","workbook":"xlsx","n_sheets":17,"sheets":["Стенды","Строки","Таблички","Буквы","Печать","ФТабл.","ФБуквы","Короба","ФКороба","Бланк заказа","Лист3","Матер","ЗП буквы","Световые короба","Световые короба калькулятор","Смета","Смета (образец)"],"not_rendered":{"charts":0,"images":1,"macros":1,"external_links":0,"defined_names":19,"comments":5,"pivot_tables":0},"unopened":[],"bounds":{"document_bytes":16777216,"sheet_cells":100000,"rows_first":2000,"rows_last":500,"rows_between":2000,"halvings":0,"cell_chars":16384,"cell_head_chars":4096},"cells_cut":0,"cells_raw":0,"read":"whole","date_system":"1900"}

{"sheet":"Стенды","index":0,"n_rows":20,"n_cols":17,"rows_kept":20,"cut":false,"hidden":true,"merged":[[0,0,1,16],[3,0,3,8],[3,11,3,16],[4,11,4,12],[4,14,5,14],[5,0,5,1],[5,2,6,3],[5,4,6,4],[5,5,6,5],[5,6,6,7],[14,13,17,16],[19,1,20,4],[5,8,6,8],[5,9,6,9],[7,0,11,0],[7,1,11,1],[13,2,13,8],[13,11,13,12]]}
["Рекламно производственная компания \"Белый Сокол\""]
[]
[]
["Нестандартные информационные стенды",null,null,null,null,null,null,null,null,null,null,"Стандартные информационные стенды"]
[null,null,null,null,null,null,null,null,null,null,null,"Стенды",null,null,"Кол-во"]
["Размер в см.",null,"Карманы",null,"Кол-во","Ст-ть","Объёмные карманы",null,"Кол-во","Ст-ть",null,"Карманы","Размеры"]
["Ширина","высота",null,null,null,null,null,null,null,null,null,1,"30х45",null,1,true,{"$f":"IF(P7,300)*O7","v":300}]
[80,100,"А5",80,0,{"$f":"D8*E8","v":0},"Под визитки",150,null,{"$f":"I8*H8","v":0},null,2,"60х50",null,1,{"$f":"FALSE","v":false},{"$f":"IF(P8,650)*O8","v":0}]
[null,null,"А4",150,6,{"$f":"D9*E9","v":900},"А5",250,1,{"$f":"I9*H9","v":250},null,3,"80х50",null,1,{"$f":"FALSE","v":false},{"$f":"IF(P9,900)*O9","v":0}]
[null,null,"А3",200,0,{"$f":"D10*E10","v":0},"А4",300,0,{"$f":"I10*H10","v":0},null,4,"60х80",null,1,false,{"$f":"IF(P10,1120)*O10","v":0}]
{"$rows_left_out":11}
{"sheet":"Строки","index":1,"n_rows":1083,"n_cols":117,"rows_kept":1083,"cut":false,"hidden":true,"merged":[[5,0,5,1],[5,2,5,4],[11,0,11,1],[49,3,55,3],[72,5,72,6]]}
[null,"Ширина, см","Высота, см","Количество"]
[null,null,null,1,"Курс доллара"]
["Количество модулей",11,2,{"$f":"B3*C3","v":22},64]
["Габаритные размеры",{"$f":"(B3*320)+70","v":3590},{"$f":"(C3*160)+70","v":390}]
[]
["Доп. опции",null,"Способ передачи информации"]
[]
[]
["Итого",null,null,null,{"$f":"E43","v":39233.091188571423},{"$f":"F43","v":613.01704982142849}]
["Цена для РА",null,null,null,{"$f":"E9-(E9*0.1)","v":35309.782069714282},{"$f":"E10+E10*0.1","v":38840.760276685709},"Для РА с монтажом"]
{"$rows_left_out":1074}
{"sheet":"Таблички","index":2,"n_rows":32,"n_cols":26,"rows_kept":32,"cut":false,"hidden":true,"merged":[[19,20,19,21],[5,6,6,6],[5,7,6,19],[9,20,9,25],[10,2,10,3],[10,4,10,6],[10,20,10,21],[10,23,11,23],[7,6,8,18],[5,5,6,5],[0,1,1,3],[3,1,3,3],[5,1,6,1],[5,2,5,3],[5,4,6,4],[24,1,25,2],[13,2,13,3],[16,2,16,3],[17,2,17,3],[18,2,18,3],[19,2,19,3]]}
[null,"Рекламно производственная компания \"Белый Сокол\""]
[]
[]
[null,"Нестандартные таблички от 1 м2"]
[]
[null,"Количество","Размер в см.",null,"Площадь м2"]
[null,null,"Ширина","Высота"]
[null,1,30,20,{"$f":"C8*D8/10000","v":0.06}]
[]
[null,null,null,null,null,null,null,null,null,null,null,null,null,null,null,null,null,null,null,null,"Стандартные таблички"]
{"$rows_left_out":23}
{"sheet":"Буквы","index":3,"n_rows":44,"n_cols":11,"rows_kept":44,"cut":false,"hidden":true,"merged":[[6,4,6,6],[7,4,7,6],[1,0,1,10],[2,0,2,10],[3,1,3,2],[3,4,3,6],[4,0,5,0],[4,1,5,1],[4,2,5,2],[4,3,5,3],[4,4,4,6],[4,7,5,7],[4,8,5,8],[4,9,5,9],[4,10,5,10],[5,4,5,6],[8,9,8,10],[10,0,10,1],[11,0,11,3],[11,5,11,7],[13,0,13,3],[14,0,14,3],[14,4,15,4],[14,5,15,5],[14,6,15,6],[15,0,15,3],[22,0,22,8],[23,0,23,5],[24,0,24,5],[25,0,25,7],[16,0,16,3],[17,0,17,3],[18,0,18,3],[19,0,19,2],[20,0,20,5],[21,0,21,5]]}
[]
["Коммерческое предложение на изготовление объемных букв"]
[]
["Буквы",null,null,"Вид букв"]
[null,"Кол-во букв","Высота буквы (ширина)","Цена за 1 см высоты буквы (руб.)","Тип шрифта ",null,null,"\"Золотой\" или \"серебряный\" профиль (наценка - 20%)","Neon 2 нити или LED (15%). Толщина линии буквы от 15 до 30 см.","Сумма","Покраска"]
[null,null,null,null,"(наценка на шрифт: сложный и рукописный – 15%, с засечками – 20%)"]
[null,15,110,{"$f":"ФБуквы!D33","v":144.05234616000001},null,null,null,null,null,{"$f":"ФБуквы!E33+ФБуквы!H33+ФБуквы!I33","v":237686.37116400001}]
[null,1,158,{"$f":"VLOOKUP(ФБуквы!B14,ФБуквы!A20:G28,4,0)","v":144.05234616000001},null,null,null,null,null,{"$f":"ФБуквы!E34+ФБуквы!H34+ФБуквы!I34","v":22760.270693280003}]
[]
[null,null,null,null,null,null,null,"Скидка, %",0,"Итого:",{"$f":"SUM(J7:J8)+SUM(K7:K8)","v":260446.64185728002}]
{"$rows_left_out":35}
{"sheet":"Печать","index":4,"n_rows":42,"n_cols":26,"rows_kept":42,"cut":false,"hidden":true,"merged":[[0,1,1,3],[2,1,2,3],[4,1,5,1],[4,2,4,3],[4,4,5,4],[4,5,5,5],[20,20,20,21],[4,6,5,6],[4,7,5,19],[8,2,8,3],[8,20,8,21],[8,23,9,23],[25,1,26,2],[8,4,8,6],[10,4,10,6],[12,2,12,3],[17,2,17,3],[18,2,18,3],[19,2,19,3],[20,2,20,3]]}
[null,"Рекламно производственная компания \"Белый Сокол\""]
[]
[null,"Баннеры"]
[]
[null,"Количество","Размер в см.",null,"Площадь м2"]
[null,null,"Ширина","Высота"]
[null,1,980,260,{"$f":"C7*D7/10000","v":25.48}]
[]
[null,"Материал:",null,null,"Проклейка",null,null,null,null,null,null,null,null,null,null,null,null,null,null,null,"Стенды",null,null,"Кол-во"]
[null,null,null,null,null,null,null,null,null,null,null,null,null,null,null,null,null,null,null,null,"Карманы","Размеры"]
{"$rows_left_out":33}
{"sheet":"ФТабл.","index":5,"n_rows":107,"n_cols":21,"rows_kept":107,"cut":false,"hidden":true,"merged":[[30,11,30,13],[30,15,30,17],[30,18,30,20]]}
[]
[null,null,null,"м.кв.",null,null,null,"Профили",null,null,null,null,"Рама",null,null,null,"Печать"]
[1,"Оцинкованное железо",null,{"$f":"I43","v":1794.5},4,null,null,"Без профиля",null,0,2,null,"Нет",null,2,1,"Фон",200,{"$f":"R3-336","v":-136},4]
[2,"ПВХ 2 мм",null,1656.1200000000001,{"$f":"VLOOKUP(E3,A3:D17,4,0)","v":1981.72},null,null,"Клемшина (ПВХ профиль, уголок)",null,null,null,null,"С рамой",null,null,2,"540 dpi",336,0]
[3,"ПВХ 3 мм",null,1802.6399999999999,null,null,null,"Нильсен",null,null,null,null,null,null,null,3,"720 dpi",353,17]
[4,"ПВХ 4 мм",null,1981.72,null,null,null,"Уголок из алюминия",null,null,null,null,"Стоимость рамы",250,null,4,"1440 dpi",370,34]
[5,"ПВХ 5 мм.",null,2144.5200000000004,null,null,null,null,null,null,null,null,null,null,null,5,"Плоттер 2 цвета",400,64]
[6,"ПВХ 6 мм.",null,2681.7599999999998,null,null,null,null,null,null,null,null,null,null,null,6,"Плоттер 3 цвета",600,264]
[7,"ПВХ 8 мм",null,2904.5,null,null,null,"Площадь единицы продукции (кв.м)",{"$f":"Таблички!C8*Таблички!D8/10000","v":0.06},null,null,null,null,null,null,7,"Плоттер 3 - 5 цветов",800,464]
[8,"ПВХ 10 мм",null,{"$f":"I50","v":3458.0199999999995},null,null,null,"Периметр",{"$f":"((Таблички!C8*2)+(Таблички!D8*2))/100","v":1},null,null,null,null,null,null,8,"Транслюцентная плёнка",880,544]
{"$rows_left_out":98}
{"sheet":"ФБуквы","index":6,"n_rows":115,"n_cols":11,"rows_kept":115,"cut":false,"hidden":true,"merged":[[0,9,6,9],[15,2,15,6],[16,2,18,2],[16,3,18,3],[16,4,18,4],[16,5,18,5],[16,6,18,6],[30,1,31,1],[30,2,31,2],[30,3,31,3],[30,4,30,6],[0,8,6,8],[30,8,31,8],[28,2,28,6],[30,9,30,10],[31,4,31,6],[32,4,32,6],[33,4,33,6],[30,7,31,7]]}
[null,"Вид буквы",null,null,"Вид шрифта",null,null,null,"«золотой» и «серебряный» профиль (наценка - 20%)","Закатка пленкой (10-20%)"]
[null,"Псевдообъём"]
[null,"Псевдообъём, \"Элькамет\""]
[null,"Псевдообъём, пластиковый бок до 5 см"]
[null,{"$f":"B23","v":"1. Объёмная буква  (LED в лицо)"}]
[null,"Псевдообъём, LED контражур"]
[null,{"$f":"B25","v":"2. Акрил-Лайт "},null,null,"Простой"]
[null,{"$f":"B26","v":"3. Пластик-Лайт "},null,null,"Сложный, рукописный",null,null,1,false,false]
[null,{"$f":"B27","v":"4. ALS - лайт (ALS, Элькамет, LED)"},null,null,"Шрифт с засечками",null,null,2,{"$f":"FALSE","v":false},{"$f":"FALSE","v":false}]
[null,"Объёмные буквы (без подсветки)",null,null,null,null,null,3,{"$f":"TRUE","v":true},{"$f":"FALSE","v":false}]
{"$rows_left_out":106}
{"sheet":"Короба","index":7,"n_rows":26,"n_cols":26,"rows_kept":26,"cut":false,"hidden":true,"merged":[[0,1,1,3],[3,1,3,3],[5,1,6,1],[5,2,5,3],[5,4,6,4],[21,2,21,3],[21,20,21,21],[5,6,6,6],[5,7,6,19],[10,2,10,3],[18,2,18,3],[19,2,19,3],[20,2,20,3],[5,5,6,5]]}
[null,"Рекламно производственная компания \"Белый Сокол\""]
[]
[]
[null,"Нестандартные короба от 1 м2"]
[]
[null,"Количество","Размер в см.",null,"Площадь м2"]
[null,null,"Ширина","Высота"]
[null,1,250,70,{"$f":"C8*D8/10000","v":1.75}]
[]
[]
{"$rows_left_out":17}
{"sheet":"ФКороба","index":8,"n_rows":33,"n_cols":7,"rows_kept":33,"cut":false,"hidden":true,"merged":[]}
[]
[null,"Короб",3,null,null,"Площадь"]
[null,"Односторонний",{"$f":"IF(C2=1,1,IF(C2=2,1.2,IF(C2=3,1.4)))","v":1.4},null,null,"Единичного",{"$f":"Короба!C8*Короба!D8/10000","v":1.75}]
[null,"+ боковое свечение",null,null,null,"Общая",{"$f":"Короба!D8*Короба!C8*Короба!B8/10000","v":1.75}]
[null,"Двухсторонний"]
[null,"Композитный короб"]
[]
[]
[]
[null,"Подсветка",2]
{"$rows_left_out":24}
{"sheet":"Бланк заказа","index":9,"n_rows":54,"n_cols":8,"rows_kept":54,"cut":false,"hidden":true,"merged":[[4,1,4,2],[4,3,4,7],[1,1,2,2],[1,6,1,7],[2,6,2,7],[3,1,3,2],[3,3,3,7],[22,1,22,2],[5,1,5,2],[5,3,5,7],[6,1,6,2],[6,3,6,7],[7,1,7,2],[7,3,7,7],[8,2,16,7],[17,1,18,2],[17,3,18,7],[19,1,20,7],[21,1,21,2],[34,1,34,5],[34,6,34,7],[23,1,23,2],[24,1,24,2],[25,1,25,2],[25,3,25,7],[27,1,27,2],[28,1,28,2],[29,1,29,2],[30,1,30,2],[30,3,30,7],[31,1,31,2],[31,3,31,7],[35,2,35,4],[35,5,35,6],[36,2,36,6],[37,2,37,4],[38,1,40,1],[38,2,38,5],[39,2,39,5],[40,2,40,5],[41,1,43,1],[41,2,41,5],[42,2,42,5],[43,2,43,5],[44,1,46,1],[44,2,44,5],[45,2,45,5],[46,2,46,5],[53,1,55,1],[53,2,53,5],[54,2,54,5],[55,2,55,5],[47,1,49,1],[47,2,47,5],[48,2,48,5],[49,2,49,5],[50,1,52,1],[50,2,50,5],[51,2,51,5],[52,2,52,5]]}
[]
[null,"БЛАНК-ЗАКАЗА №",null,null,null,"Дата поступления","Срок сдачи"]
[]
[null,"Заказчик"]
[null,"Конт. лицо со стороны Заказчика"]
[null,"Монтаж /да, нет/ (Адрес)"]
[null,"Менеджер",null,"Рамазанова Анфиса"]
[null,"Доставка /да, нет/ (Адрес)"]
[]
[]
{"$rows_left_out":45}
{"sheet":"Лист3","index":10,"n_rows":26,"n_cols":27,"rows_kept":26,"cut":false,"hidden":true,"merged":[[2,10,3,10],[2,1,3,1],[2,2,3,2],[2,3,3,3],[2,4,3,4],[2,7,3,7],[2,8,3,8]]}
[]
["Буквы"]
[null,"Кол-во букв","Высота буквы (ширина)","Вид букв","Цена за 1 см. высоты буквы",null,null,"Тип шрифта (рукописный - 15%, с засечками - 20%)","\"Золотой\" или \"Серебрянный\" профиль (наценка - 20%)",null,"Сумма"]
[null,null,null,null,null,null,null,null,null,null,null,null,null,"пвх руб.",null,"Резка руб.","плёнка","накатка",null,null,null,null,null,null,"Итого","Стоимость","Прибыль"]
[null,4,30,"несветовые, псевдообъёмные",20,8,11.23,14.5,17.66,26.24,{"$f":"Z5*B5","v":961.92000000000007},null,{"$f":"C5","v":30},{"$f":"C5*M5*0.03","v":27},null,{"$f":"C5*6*0.5","v":90},{"$f":"M5*C5*0.012","v":10.8},{"$f":"M5*C5*0.025","v":22.5},null,null,null,null,null,null,{"$f":"R5+Q5+P5+N5","v":150.30000000000001},{"$f":"Y5*1.6","v":240.48000000000002},{"$f":"Z5-Y5","v":90.18}]
[null,null,null,null,null,30,60,90,120,"120-",null,null,null,null,null,null,null,null,"Элькамет","Укладка элькамета"]
[null,1,200,"несветовые, элькамет",null,23.38,26.6,29.8,33,40,{"$f":"Z7*B7","v":8320},null,{"$f":"C7","v":200},{"$f":"C7*M7*0.03","v":1200},null,{"$f":"C7*6*0.5","v":600},{"$f":"M7*C7*0.012","v":480},{"$f":"M7*C7*0.025","v":1000},{"$f":"M7*6*1","v":1200},{"$f":"C7*6*0.6","v":720},null,null,null,null,{"$f":"R7+Q7+P7+N7+S7+T7","v":5200},{"$f":"Y7*1.6","v":8320},{"$f":"Z7-Y7","v":3120}]
[null,null,null,null,null,null,null,null,null,null,null,null,null,null,null,null,null,null,null,null,null,null,"LED","Установка LED"]
[null,1,200,"с элькаметом, LED в лицо",null,83.38,86.6,89.8,93,{"$f":"K9/C9","v":101.6},{"$f":"Z9*B9","v":20320},null,{"$f":"C9","v":200},{"$f":"C9*M9*0.03","v":1200},null,{"$f":"C9*6*0.5","v":600},{"$f":"M9*C9*0.012","v":480},{"$f":"M9*C9*0.025","v":1000},{"$f":"M9*6*1","v":1200},{"$f":"C9*6*0.6","v":720},null,null,{"$f":"C9*6/1.6*5","v":3750},{"$f":"C9*6/1.6*5","v":3750},{"$f":"R9+Q9+P9+N9+S9+T9+W9+X9","v":12700},{"$f":"Y9*1.6","v":20320},{"$f":"Z9-Y9","v":7620}]
[]
{"$rows_left_out":17}
{"sheet":"Матер","index":11,"n_rows":126,"n_cols":8,"rows_kept":126,"cut":false,"hidden":true,"merged":[]}
["Журнал данных прайс-листа и продаж по товарам"]
[]
["Код товара","Наименование товара","Цена на дату","Розн. цена за ед.","Продано в розницу","Продано оптом","Всего продаж (шт.)","Всего продаж ($)"]
[null,"Листовой материал"]
[1,"ПВХ 2мм (2,0х3,0м)","26,01,2016",1450,{"$f":"D5/6","v":241.66666666666666}]
[2,"ПВХ 3мм (2,0х3,0м)","26,01,2016",1900,{"$f":"D6/6","v":316.66666666666669}]
[3,"ПВХ 4мм (2,0х3,0м)","26,01,2016",2450,408.33333333333331]
[4,"ПВХ 5мм (2,0х3,0м)","26,01,2019",2950,491.66666666666669]
[6,"ПВХ 8мм (2,0х3,0м)","26,01,2020",5000,833.33333333333337]
[7,"ПВХ 10мм (2,0х3,0м)","26,01,2021",6700,1116.6666666666667]
{"$rows_left_out":117}
{"sheet":"ЗП буквы","index":12,"n_rows":293,"n_cols":11,"rows_kept":293,"cut":false,"hidden":true,"merged":[[7,0,7,3]]}
[]
[null,"Высота","Количество","Сумма за см.","Итого","Коэффициент"]
["F",{"$f":"ФБуквы!C33","v":110},{"$f":"ФБуквы!B33","v":15},{"$f":"VLOOKUP(B3,J3:K293,2,0)","v":17},{"$f":"D3*C3*B3","v":28050},{"$f":"E3","v":28050},null,null,1,300,10]
["a",116,2,{"$f":"VLOOKUP(B4,J3:K283,2,0)","v":17},{"$f":"D4*C4*B4","v":3944},{"$f":"E4","v":3944},null,null,2,299,10]
["m",215,1,{"$f":"VLOOKUP(B5,J3:K283,2,0)","v":10},{"$f":"D5*C5*B5","v":2150},{"$f":"E5","v":2150},null,null,3,298,10]
["i",146,2,{"$f":"VLOOKUP(B6,J4:K284,2,0)","v":16},{"$f":"D6*C6*B6","v":4672},{"$f":"E6/2","v":2336},null,null,4,297,10]
["l",159,1,{"$f":"VLOOKUP(B7,J5:K285,2,0)","v":16},{"$f":"D7*C7*B7","v":2544},{"$f":"E7/3","v":848},null,null,5,296,10]
["Итого:",null,null,null,{"$f":"SUM(E3:E7)","v":41360},{"$f":"SUM(F3:F7)","v":37328},null,null,6,295,10]
[null,null,null,null,null,null,null,null,7,294,10]
[null,null,null,null,null,null,null,null,8,293,10]
{"$rows_left_out":284}
{"sheet":"Световые короба","index":13,"n_rows":45,"n_cols":14,"rows_kept":45,"cut":false,"hidden":true,"merged":[]}
[]
[null,null,null,"за ед."]
["Высота","Ширина","Площадь","Периметр"]
[100,100,{"$f":"B4*A4/10000","v":1},{"$f":"(A4*2+B4*2)/100","v":4},"Алюминий+LED","Алюминий+сотовый+лампы","Короб из ALS и Элькамета","Эконом-LED+","Эконом-LED","Металл+сотовый","Металл+акрил ","Баннер","Композит","Композит + инкрустация"]
["Периметр, м",{"$f":"((A4*2)+(B4*2))/100","v":4}]
[]
["Проф труба",null,6,200,null,null,null,null,null,{"$f":"C7*D7*C4","v":1200},{"$f":"J7","v":1200},{"$f":"C7*D7*C4","v":1200},{"$f":"L7","v":1200},{"$f":"M7","v":1200}]
["Профиль"]
[null,"1. Оцинкованная сталь",null,450,null,null,null,null,null,{"$f":"(D4*0.35)*D9","v":630},{"$f":"J9","v":630},{"$f":"J9","v":630}]
[null,"2. Алюминиевый"]
{"$rows_left_out":36}
{"sheet":"Световые короба калькулятор","index":14,"n_rows":96,"n_cols":17,"rows_kept":96,"cut":false,"hidden":false,"merged":[[8,3,8,4],[4,7,4,10]]}
[]
[null,null,"Расчет"]
[]
[null,null,"Высота (см)","Ширина (см)","Площадь (м2)","Периметр (м)"]
[null,null,200,500,{"$f":"D5*C5/10000","v":10},{"$f":"(C5+D5)*2/100","v":14},null,"Колонки для сметы",null,null,null,null,null,"Инструкция:"]
[]
[null,null,null,null,"Стоимость за ед.","Сумма",null,"Статья затрат","Ед.изм.","Цена за ед.","Расход",null,null,"1. Выбираем тип короба - устанавливаются значения по умолчанию"]
[]
[null,null,"Короб:","Композит",null,null,null,null,null,null,null,null,null,"2. Если нужно корректировать - корректировка выбором допустимых значений"]
[]
{"$rows_left_out":87}
{"sheet":"Смета","index":15,"n_rows":29,"n_cols":10,"rows_kept":29,"cut":false,"hidden":false,"merged":[[5,0,6,0],[5,1,6,1],[5,2,6,2],[5,3,6,3],[5,4,6,4],[1,2,2,7],[5,5,5,9],[7,1,12,1],[7,2,12,2],[7,3,12,3],[7,4,12,4]]}
[]
[null,null,"Коммерческое предложение на изготовление и монтаж рекламной накрышной установки для магазина \"Посуда Центр\" в г. Нижнем Новгороде на ТЦ \"ЖАРПТИЦА\""]
[]
[null,"Подрядчик \"Белый Сокол\""]
[]
["№ п/п","Магазин","Наименование","Кол-во, шт.","Размеры, мм","калькуляция"]
[null,null,null,null,null,"статья затрат","ед.изм.","расход ","цена за ед.","сумма"]
[1,"Посуда центр","Изготовление и монтаж накрышной установки",1,"5000x2000","Проф труба:  ",null,null,0,12000]
[2,null,null,null,null,"Провода, крепёж, покраска: ","шт.",1,200,2000]
[3,null,null,null,null,"Лицевая: акрил ",null,null,338.90000000000003,1016.7]
{"$rows_left_out":20}
{"sheet":"Смета (образец)","index":16,"n_rows":40,"n_cols":10,"rows_kept":40,"cut":false,"hidden":true,"merged":[[5,0,6,0],[5,1,6,1],[5,2,6,2],[5,3,6,3],[5,4,6,4],[7,1,23,1],[7,2,23,2],[7,3,23,3],[7,4,23,4],[1,2,2,7],[5,5,5,9]]}
[]
[null,null,"Коммерческое предложение на изготовление и монтаж рекламной накрышной установки для магазина \"Посуда Центр\" в г. Нижнем Новгороде на ТЦ \"ЖАРПТИЦА\""]
[]
[null,"Подрядчик \"Белый Сокол\""]
[]
["№ п/п","Магазин","Наименование","Кол-во, шт.","Размеры, мм","калькуляция"]
[null,null,null,null,null,"статья затрат","ед.изм.","расход ","цена за ед.","сумма"]
[1,"Посуда Центр","Изгготовление и монтаж накрышной установки",1,"12000х2700","Акрил 3 мм","м2",17.5,1100,{"$f":"H8*I8","v":19250}]
[2,null,null,null,null,"Элькамет","м.п.",78.599999999999994,295,{"$f":"H9*I9","v":23187}]
[3,null,null,null,null,"Профиль ALS","м.п.",78.599999999999994,186,14619.599999999999]
{"$rows_left_out":30}